
src/core/ngx_murmurhash.c
src/core/ngx_murmurhash.c: In function ‘ngx_murmur_hash2’:
src/core/ngx_murmurhash.c:37:11: error: this statement may fall through [-Werror=implicit-fallthrough=]
h ^= data[2] << 16;
~~^~~~~~~~~~~~~~~~
src/core/ngx_murmurhash.c:38:5: note: here
case 2:
^~~~
src/core/ngx_murmurhash.c:39:11: error: this statement may fall through [-Werror=implicit-fallthrough=]
h ^= data[1] << 8;
~~^~~~~~~~~~~~~~~
src/core/ngx_murmurhash.c:40:5: note: here
case 1:
^~~~
cc1: all warnings being treated as errors
objs/Makefile:495: recipe for target 'objs/src/core/ngx_murmurhash.o' failed
make[1]: *** [objs/src/core/ngx_murmurhash.o] Error 1
| 欢迎光临 VPS侦探论坛 (https://bbs.lnmp.com/) | Powered by Discuz! X3.4 |